Target
Prostaglandin E2 receptor EP2 subtype
Ligand
BDBM50506572
Substrate
Meas. Tech.
ChEMBL_1826277 (CHEMBL4326151)
EC50
4.5±n/a nM
Citation
 Iwamura, RTanaka, MOkanari, EKirihara, TOdani-Kawabata, NShams, NYoneda, K Identification of a Selective, Non-Prostanoid EP2 Receptor Agonist for the Treatment of Glaucoma: Omidenepag and its Prodrug Omidenepag Isopropyl. J Med Chem 61:6869-6891 (2018)  
Target
Name:
Prostaglandin E2 receptor EP2 subtype
Synonyms:
PE2R2_HUMAN PTGER2 Prostaglandin E2 receptor Prostanoid EP2 Receptor
Type:
Enzyme
Mol. Mass.:
39775.71
Organism:
Homo sapiens (Human)
Description:
P43116
Residue:
358
  
Inhibitor
Name:
BDBM50506572
Synonyms:
CHEMBL4458330
Type:
Small organic molecule
Emp. Form.:
C25H28N4O4S
Mol. Mass.:
480.579
SMILES:
CCC1(CC1)c1ccc(CN(Cc2cccc(NCC(O)=O)n2)S(=O)(=O)c2cccnc2)cc1
: