Target
Phosphatidylinositol 3-kinase regulatory subunit alpha/4,5-bisphosphate 3-kinase catalytic subunit delta isoform
Ligand
BDBM368657
Substrate
Meas. Tech.
ChEMBL_1826559 (CHEMBL4326433)
IC50
>10000±n/a nM
Citation
 Chandrasekhar, JDick, RVan Veldhuizen, JKoditek, DLepist, EIMcGrath, MEPatel, LPhillips, GSedillo, KSomoza, JRTherrien, JTill, NATreiberg, JVillaseņor, AGZherebina, YPerreault, S Atropisomerism by Design: Discovery of a Selective and Stable Phosphoinositide 3-Kinase (PI3K) ? Inhibitor. J Med Chem 61:6858-6868 (2018)  
Target
Name:
Phosphatidylinositol 3-kinase regulatory subunit alpha/4,5-bisphosphate 3-kinase catalytic subunit delta isoform
Synonyms:
PI3-kinase p110-delta/p85-alpha PI3-kinase subunit p110 delta/p85 alpha PIK3CD/PIK3R1 p110delta/p85alpha
Type:
Heterodimer of a p110 (catalytic) and a p85 (regulatory) subunit
Mol. Mass.:
Description:
Recombinant human p110delta was coexpressed in an Sf9 baculovirus system with the p85alpha regulatory subunit and purified as GST-fusion protein using affinity chromatography on glutathione-sepharose.
Components:
This complex has 2 components.
Component 1
Name:
Phosphatidylinositol 4,5-bisphosphate 3-kinase catalytic subunit delta isoform
Synonyms:
PI3-kinase p110 subunit delta PI3-kinase subunit p110-delta PIK3CD Phosphatidylinositol 4,5-biphosphate 3-kinase catalytic subunit delta (PIK3CD) Phosphatidylinositol 4,5-bisphosphate 3-kinase 110 kDa catalytic subunit delta (PI3K delta) Phosphatidylinositol 4,5-bisphosphate 3-kinase catalytic subunit delta (PI3Kdelta) Phosphatidylinositol 4,5-bisphosphate 3-kinase catalytic subunit delta isoform (PI3K delta) Phosphatidylinositol 4,5-bisphosphate 3-kinase catalytic subunit delta isoform (PI3K-delta) Phosphatidylinositol 4,5-bisphosphate 3-kinase catalytic subunit delta isoform (PI3Kdelta)
Type:
Enzyme Subunit
Mol. Mass.:
119489.41
Organism:
Homo sapiens (Human)
Description:
O00329
Residue:
1044
  
Component 2
Name:
Phosphatidylinositol 3-kinase regulatory subunit alpha
Synonyms:
GRB1 PI3-kinase class I PI3-kinase p85-alpha subunit PI3-kinase subunit p85-alpha PIK3CG/PIK3R1 Phosphatidylinositol 3-kinase 85 kDa regulatory subunit alpha (PI3K alpha) Phosphatidylinositol 3-kinase regulatory subunit alpha (PIK3R1) Phosphatidylinositol 3-kinase regulatory subunit alpha isoform 1 (PI3 Kinase alpha) Phosphatidylinositol 4,5-bisphosphate 3-kinase catalytic subunit alpha isoform (PI3Kalpha) PtdIns-3-kinase p85-alpha p85 alpha
Type:
Protein
Mol. Mass.:
83592.82
Organism:
Homo sapiens (Human)
Description:
P27986
Residue:
724
  
Inhibitor
Name:
BDBM368657
Synonyms:
US10227350, Compound 105 US10227350, Compound 75
Type:
Small organic molecule
Emp. Form.:
C24H15F3N8
Mol. Mass.:
472.4247
SMILES:
Cc1nc2c(cc(cc2n1-c1ccnc2c(F)ccc(F)c12)-c1ccnc(N)c1F)-c1nnc[nH]1
: