Target
Phosphatidylinositol 4,5-bisphosphate 3-kinase catalytic subunit gamma isoform
Ligand
BDBM368657
Substrate
Meas. Tech.
ChEMBL_1826560 (CHEMBL4326434)
IC50
>10000±n/a nM
Citation
 Chandrasekhar, JDick, RVan Veldhuizen, JKoditek, DLepist, EIMcGrath, MEPatel, LPhillips, GSedillo, KSomoza, JRTherrien, JTill, NATreiberg, JVillaseņor, AGZherebina, YPerreault, S Atropisomerism by Design: Discovery of a Selective and Stable Phosphoinositide 3-Kinase (PI3K) ? Inhibitor. J Med Chem 61:6858-6868 (2018)  
Target
Name:
Phosphatidylinositol 4,5-bisphosphate 3-kinase catalytic subunit gamma isoform
Synonyms:
PI3-kinase p110 subunit gamma PI3Kgamma PK3CG_HUMAN Phosphatidylinositol 4,5-bisphosphate 3-kinase (PI3K) Phosphatidylinositol 4,5-bisphosphate 3-kinase catalytic subunit gamma (PI3Kgamma) Phosphatidylinositol 4,5-bisphosphate 3-kinase catalytic subunit gamma isoform (PI3K) Phosphatidylinositol-4,5-bisphosphate 3-kinase catalytic subunit gamma isoform Phosphoinositide 3-kinases gamma (PI3K gamma) p120-PI3K
Type:
Enzyme Subunit
Mol. Mass.:
126470.30
Organism:
Homo sapiens (Human)
Description:
P48736
Residue:
1102
  
Inhibitor
Name:
BDBM368657
Synonyms:
US10227350, Compound 105 US10227350, Compound 75
Type:
Small organic molecule
Emp. Form.:
C24H15F3N8
Mol. Mass.:
472.4247
SMILES:
Cc1nc2c(cc(cc2n1-c1ccnc2c(F)ccc(F)c12)-c1ccnc(N)c1F)-c1nnc[nH]1
: