Target
Glucocorticoid receptor
Ligand
BDBM50506863
Substrate
Meas. Tech.
ChEMBL_1827551 (CHEMBL4327425)
IC50
1012±n/a nM
Citation
 Badarau, ERobert, FMassip, SJakob, FLucas, SFriebe, DHennen, SFrormann, SGhosez, L Discovery of a subnanomolar and selective spirocyclic agonist of the glucocorticoid receptor. Eur J Med Chem 161:354-363 (2019)  
Target
Name:
Glucocorticoid receptor
Synonyms:
GCR_HUMAN GRL Glucocorticoid receptor (GRFP) Nuclear receptor subfamily 3 group C member 1
Type:
Enzyme
Mol. Mass.:
85656.87
Organism:
Homo sapiens (Human)
Description:
P04150
Residue:
777
  
Inhibitor
Name:
BDBM50506863
Synonyms:
CHEMBL4446696
Type:
Small organic molecule
Emp. Form.:
C24H23FN2O
Mol. Mass.:
374.4506
SMILES:
O[C@@]1(CCCC[C@]11Cc2cnn(c2C=C1)-c1ccc(F)cc1)c1ccccc1
: