Target
Tyrosyl-DNA phosphodiesterase 1
Ligand
BDBM50507152
Substrate
Meas. Tech.
ChEMBL_1829132 (CHEMBL4329006)
Kd
44550±n/a nM
Citation
 Zakharenko, ALLuzina, OASokolov, DNKaledin, VINikolin, VPPopova, NAPatel, JZakharova, ODChepanova, AAZafar, AReynisson, JLeung, ELeung, IKHVolcho, KPSalakhutdinov, NFLavrik, OI Novel tyrosyl-DNA phosphodiesterase 1 inhibitors enhance the therapeutic impact of topote?an on in vivo tumor models. Eur J Med Chem 161:581-593 (2019)  
Target
Name:
Tyrosyl-DNA phosphodiesterase 1
Synonyms:
TDP1 Tyrosyl-DNA phosphodiesterase 1 | Tyrosyl-DNA phosphodiesterase 1 (TDP1)
Type:
Enzyme
Mol. Mass.:
68430.66
Organism:
Homo sapiens (Human)
Description:
Q9NUW8
Residue:
608
  
Inhibitor
Name:
BDBM50507152
Synonyms:
CHEMBL4436400
Type:
Small organic molecule
Emp. Form.:
C27H23N3O8S
Mol. Mass.:
549.552
SMILES:
COc1cc(\C=N\Nc2nc(cs2)-c2c3OC4=CC(O)=C(C(C)=O)C(=O)[C@]4(C)c3c(O)c(C)c2O)ccc1O
: