Target
Tyrosyl-DNA phosphodiesterase 1
Ligand
BDBM50507156
Substrate
Meas. Tech.
ChEMBL_1829132 (CHEMBL4329006)
Kd
35240±n/a nM
Citation
 Zakharenko, ALLuzina, OASokolov, DNKaledin, VINikolin, VPPopova, NAPatel, JZakharova, ODChepanova, AAZafar, AReynisson, JLeung, ELeung, IKHVolcho, KPSalakhutdinov, NFLavrik, OI Novel tyrosyl-DNA phosphodiesterase 1 inhibitors enhance the therapeutic impact of topote?an on in vivo tumor models. Eur J Med Chem 161:581-593 (2019)  
Target
Name:
Tyrosyl-DNA phosphodiesterase 1
Synonyms:
TDP1 Tyrosyl-DNA phosphodiesterase 1 | Tyrosyl-DNA phosphodiesterase 1 (TDP1)
Type:
Enzyme
Mol. Mass.:
68430.66
Organism:
Homo sapiens (Human)
Description:
Q9NUW8
Residue:
608
  
Inhibitor
Name:
BDBM50507156
Synonyms:
CHEMBL4475772
Type:
Small organic molecule
Emp. Form.:
C26H20FN3O6S
Mol. Mass.:
521.517
SMILES:
CC(=O)C1=C(O)C=C2Oc3c(c(O)c(C)c(O)c3-c3csc(N\N=C\c4ccc(F)cc4)n3)[C@@]2(C)C1=O
: