Target
Inhibitor of nuclear factor kappa-B kinase subunit beta
Ligand
BDBM50507353
Substrate
Meas. Tech.
ChEMBL_1829790 (CHEMBL4329664)
IC50
13±n/a nM
Citation
 Kerns, JKBusch-Petersen, JFu, WBoehm, JCNie, HMuratore, MBullion, ALin, GLi, HDavis, RLin, XLakdawala, ASCousins, RField, RPayne, JMiller, DDBamborough, PChristopher, JABaldwin, IOsborn, RRYonchuk, JWebb, ERumsey, WL 3,5-Disubstituted-indole-7-carboxamides as IKK? Inhibitors: Optimization of Oral Activity via the C3 Substituent. ACS Med Chem Lett 9:1164-1169 (2018)  
Target
Name:
Inhibitor of nuclear factor kappa-B kinase subunit beta
Synonyms:
I-kappa-B Kinase 2 (IKK-beta) I-kappa-B-kinase beta IKBKB IKK-beta IKK2/IKK1 IKKB_HUMAN Inhibitor of nuclear factor kappa B kinase beta subunit Nuclear factor NF-kappa-B inhibitor kinase beta
Type:
Serine/threonine-protein kinase
Mol. Mass.:
86554.39
Organism:
Homo sapiens (Human)
Description:
GST-tagged IKK-2 was expressed in High Five cells and purified.
Residue:
756
  
Inhibitor
Name:
BDBM50507353
Synonyms:
CHEMBL4564744
Type:
Small organic molecule
Emp. Form.:
C20H19FN2O3S
Mol. Mass.:
386.44
SMILES:
NC(=O)c1cc(cc2c(c[nH]c12)C1CCS(=O)(=O)CC1)-c1ccc(F)cc1
: