Target
Acetylcholinesterase
Ligand
BDBM50059724
Substrate
Meas. Tech.
ChEMBL_28628 (CHEMBL644626)
IC50
2193.5±n/a nM
Citation
 Yu, QSPei, XFHolloway, HWGreig, NHBrossi, A Total syntheses and anticholinesterase activities of (3aS)-N(8)-norphysostigmine, (3aS)-N(8)-norphenserine, their antipodal isomers, and other N(8)-substituted analogues. J Med Chem 40:2895-901 (1997)  
Target
Name:
Acetylcholinesterase
Synonyms:
ACES_HUMAN Acetylcholinesterase (AChE) | Acetylcholinesterase (human AChE)
Type:
Enzyme
Mol. Mass.:
67792.70
Organism:
Homo sapiens (Human)
Description:
P22303
Residue:
614
  
Inhibitor
Name:
BDBM50059724
Synonyms:
CHEMBL99414 | Methyl-carbamic acid (R)-1,3a-dimethyl-1,2,3,3a,8,8a-hexahydro-pyrrolo[2,3-b]indol-5-yl ester
Type:
Small organic molecule
Emp. Form.:
C14H19N3O2
Mol. Mass.:
261.3196
SMILES:
CNC(=O)Oc1ccc2NC3N(C)CC[C@]3(C)c2c1
: