Target
Cholinesterase
Ligand
BDBM10688
Substrate
Meas. Tech.
ChEMBL_41428 (CHEMBL876073)
IC50
516.3±n/a nM
Citation
 Yu, QSPei, XFHolloway, HWGreig, NHBrossi, A Total syntheses and anticholinesterase activities of (3aS)-N(8)-norphysostigmine, (3aS)-N(8)-norphenserine, their antipodal isomers, and other N(8)-substituted analogues. J Med Chem 40:2895-901 (1997)  
Target
Name:
Cholinesterase
Synonyms:
Acylcholine acylhydrolase Butyrylcholine esterase (BChE) Butyrylcholinesterase (BuChE) CHLE_HUMAN Cholinesterases Pseudocholinesterase
Type:
Homotetramer
Mol. Mass.:
68422.27
Organism:
Homo sapiens (Human)
Description:
P06276
Residue:
602
  
Inhibitor
Name:
BDBM10688
Synonyms:
(-)-N8-norphenserine CHEMBL418917
Type:
Small organic molecule
Emp. Form.:
C19H21N3O2
Mol. Mass.:
323.3889
SMILES:
CN1CC[C@]2(C)C1Nc1ccc(OC(=O)Nc3ccccc3)cc21
: