Target
Acetylcholinesterase
Ligand
BDBM50059728
Substrate
Meas. Tech.
ChEMBL_28628 (CHEMBL644626)
IC50
245.3±n/a nM
Citation
 Yu, QSPei, XFHolloway, HWGreig, NHBrossi, A Total syntheses and anticholinesterase activities of (3aS)-N(8)-norphysostigmine, (3aS)-N(8)-norphenserine, their antipodal isomers, and other N(8)-substituted analogues. J Med Chem 40:2895-901 (1997)  
Target
Name:
Acetylcholinesterase
Synonyms:
ACES_HUMAN Acetylcholinesterase (AChE) | Acetylcholinesterase (human AChE)
Type:
Enzyme
Mol. Mass.:
67792.70
Organism:
Homo sapiens (Human)
Description:
P22303
Residue:
614
  
Inhibitor
Name:
BDBM50059728
Synonyms:
CHEMBL319541 | Phenyl-carbamic acid (S)-8-benzyl-1,3a-dimethyl-1,2,3,3a,8,8a-hexahydro-pyrrolo[2,3-b]indol-5-yl ester
Type:
Small organic molecule
Emp. Form.:
C26H27N3O2
Mol. Mass.:
413.5115
SMILES:
CN1CC[C@]2(C)C1N(Cc1ccccc1)c1ccc(OC(=O)Nc3ccccc3)cc21
: