Target
Kallikrein-4
Ligand
BDBM50507483
Substrate
Meas. Tech.
ChEMBL_1830142 (CHEMBL4330016)
Ki
1.6±n/a nM
Citation
 Swedberg, JEGhani, HAHarris, JMde Veer, SJCraik, DJ Potent, Selective, and Cell-Penetrating Inhibitors of Kallikrein-Related Peptidase 4 Based on the Cyclic Peptide MCoTI-II. ACS Med Chem Lett 9:1258-1262 (2018)  
Target
Name:
Kallikrein-4
Synonyms:
EMSP1 KLK-L1 KLK4_HUMAN Kallikrein-4 PRSS17 Prostase | Serine protease 17
Type:
PROTEIN
Mol. Mass.:
27022.83
Organism:
Homo sapiens (Human)
Description:
ChEMBL_595923
Residue:
254
  
Inhibitor
Name:
BDBM50507483
Synonyms:
CHEMBL4530379
Type:
Small organic molecule
Emp. Form.:
C136H220N46O44S6
Mol. Mass.:
3395.874
SMILES:
CC[C@H](C)[C@@H]1NC(=O)[C@H](CCCCN)NC(=O)[C@@H]2CCCN2C(=O)[C@@H]2CSSC[C@@H]3NC(=O)[C@H](C)NC(=O)CNC(=O)[C@@H]4CCCN4C(=O)[C@@H]4CSSC[C@H](NC(=O)[C@H](Cc5ccc(O)cc5)NC(=O)CNC(=O)[C@H](CC(N)=O)NC(=O)CNC(=O)[C@H](CCCNC(N)=N)NC(=O)[C@H](CSSC[C@H](NC(=O)[C@H](CCCCN)NC(=O)[C@H](CCCCN)NC(=O)[C@H](CC(C)C)NC1=O)C(=O)N[C@@H](CCCNC(N)=N)C(=O)N[C@@H](CCCNC(N)=N)C(=O)N[C@@H](CC(O)=O)C(=O)N[C@@H](CO)C(=O)N[C@@H](CC(O)=O)C(=O)N4)NC(=O)[C@@H](NC3=O)[C@@H](C)CC)C(=O)NCC(=O)N[C@@H](CO)C(=O)NCC(=O)N[C@@H](CO)C(=O)N[C@@H](CC(O)=O)C(=O)NCC(=O)N[C@@H](C(C)C)C(=O)N2
: