Target
Delta-type opioid receptor
Ligand
BDBM50297170
Substrate
Meas. Tech.
ChEMBL_146341 (CHEMBL753790)
Ki
2.8±n/a nM
Citation
 Fang, XLarson, DLPortoghese, PS 7-spirobenzocyclohexyl derivatives of naltrexone, oxymorphone, and hydromorphone as selective opioid receptor ligands. J Med Chem 40:3064-70 (1997)  
Target
Name:
Delta-type opioid receptor
Synonyms:
DOR-1 MSL-2 OPRD_MOUSE Oprd1
Type:
Enzyme Catalytic Domain
Mol. Mass.:
40577.25
Organism:
MOUSE
Description:
P32300
Residue:
372
  
Inhibitor
Name:
BDBM50297170
Synonyms:
7-(2'-spiroindanyl)oxymorphone 7-spiroindanyloxymorphone SIOM | Spiroindanyloxymorphone
Type:
Small organic molecule
Emp. Form.:
C25H25NO4
Mol. Mass.:
403.4703
SMILES:
CN1CC[C@@]23[C@H]4Oc5c2c(C[C@@H]1[C@]3(O)CC1(Cc2ccccc2C1)C4=O)ccc5O
: