Target
Mu-type opioid receptor
Ligand
BDBM50059996
Substrate
Meas. Tech.
ChEMBL_148517 (CHEMBL758127)
Ki
2.8±n/a nM
Citation
 Fang, XLarson, DLPortoghese, PS 7-spirobenzocyclohexyl derivatives of naltrexone, oxymorphone, and hydromorphone as selective opioid receptor ligands. J Med Chem 40:3064-70 (1997)  
Target
Name:
Mu-type opioid receptor
Synonyms:
M-OR-1 Mor OPRM_MOUSE Oprm | Oprm1
Type:
Enzyme Catalytic Domain
Mol. Mass.:
44431.62
Organism:
MOUSE
Description:
OPIATE Mu OPRM1 MOUSE::P42866
Residue:
398
  
Inhibitor
Name:
BDBM50059996
Synonyms:
7 beta-Spirobenzocyclohexylhydromorphone | CHEMBL104159
Type:
Small organic molecule
Emp. Form.:
C26H27NO3
Mol. Mass.:
401.4975
SMILES:
CN1CCC23[C@H]4Oc5c2c(CC1[C@@H]3C[C@]1(CCc2ccccc2C1)C4=O)ccc5O
: