Target
Thromboxane-A synthase
Ligand
BDBM50060380
Substrate
Meas. Tech.
ChEMBL_207780 (CHEMBL880940)
IC50
48±n/a nM
Citation
 Dickinson, RPDack, KNLong, CJSteele, J Thromboxane modulating agents. 3. 1H-imidazol-1-ylalkyl- and 3-pyridinylalkyl-substituted 3-[2-[(arylsulfonyl)amino]ethyl]benzenepropanoic acid derivatives as dual thromboxane synthase inhibitor/thromboxane receptor antagonists. J Med Chem 40:3442-52 (1997)  
Target
Name:
Thromboxane-A synthase
Synonyms:
CYP5 Cytochrome P450 5A1 TBXAS1 TXA synthase TXS Thromboxane A2 Synthase (P450 TxA2) Thromboxane prostanoid Thromboxane-A synthase
Type:
Enzyme
Mol. Mass.:
60524.67
Organism:
Homo sapiens (Human)
Description:
P24557
Residue:
533
  
Inhibitor
Name:
BDBM50060380
Synonyms:
3-[5-(4-Fluoro-benzenesulfonylamino)-3-pyridin-3-ylmethyl-indol-1-yl]-propionic acid | CHEMBL47612
Type:
Small organic molecule
Emp. Form.:
C23H20FN3O4S
Mol. Mass.:
453.486
SMILES:
OC(=O)CCn1cc(Cc2cccnc2)c2cc(NS(=O)(=O)c3ccc(F)cc3)ccc12
: