Target
Thromboxane-A synthase
Ligand
BDBM50060379
Substrate
Meas. Tech.
ChEMBL_207780 (CHEMBL880940)
IC50
20±n/a nM
Citation
 Dickinson, RPDack, KNLong, CJSteele, J Thromboxane modulating agents. 3. 1H-imidazol-1-ylalkyl- and 3-pyridinylalkyl-substituted 3-[2-[(arylsulfonyl)amino]ethyl]benzenepropanoic acid derivatives as dual thromboxane synthase inhibitor/thromboxane receptor antagonists. J Med Chem 40:3442-52 (1997)  
Target
Name:
Thromboxane-A synthase
Synonyms:
CYP5 Cytochrome P450 5A1 TBXAS1 TXA synthase TXS Thromboxane A2 Synthase (P450 TxA2) Thromboxane prostanoid Thromboxane-A synthase
Type:
Enzyme
Mol. Mass.:
60524.67
Organism:
Homo sapiens (Human)
Description:
P24557
Residue:
533
  
Inhibitor
Name:
BDBM50060379
Synonyms:
3-{3-[2-(4-Fluoro-benzenesulfonylamino)-ethyl]-5-pyridin-3-ylmethyl-phenyl}-propionic acid | CHEMBL115387
Type:
Small organic molecule
Emp. Form.:
C23H23FN2O4S
Mol. Mass.:
442.503
SMILES:
OC(=O)CCc1cc(CCNS(=O)(=O)c2ccc(F)cc2)cc(Cc2cccnc2)c1
: