Target
Thromboxane-A synthase
Ligand
BDBM50060381
Substrate
Meas. Tech.
ChEMBL_207780 (CHEMBL880940)
IC50
61±n/a nM
Citation
 Dickinson, RPDack, KNLong, CJSteele, J Thromboxane modulating agents. 3. 1H-imidazol-1-ylalkyl- and 3-pyridinylalkyl-substituted 3-[2-[(arylsulfonyl)amino]ethyl]benzenepropanoic acid derivatives as dual thromboxane synthase inhibitor/thromboxane receptor antagonists. J Med Chem 40:3442-52 (1997)  
Target
Name:
Thromboxane-A synthase
Synonyms:
CYP5 Cytochrome P450 5A1 TBXAS1 TXA synthase TXS Thromboxane A2 Synthase (P450 TxA2) Thromboxane prostanoid Thromboxane-A synthase
Type:
Enzyme
Mol. Mass.:
60524.67
Organism:
Homo sapiens (Human)
Description:
P24557
Residue:
533
  
Inhibitor
Name:
BDBM50060381
Synonyms:
3-{1-[2-(4-Fluoro-benzenesulfonylamino)-ethyl]-2-methyl-3-pyridin-3-ylmethyl-1H-indol-5-yl}-propionic acid | CHEMBL320235
Type:
Small organic molecule
Emp. Form.:
C26H26FN3O4S
Mol. Mass.:
495.566
SMILES:
Cc1c(Cc2cccnc2)c2cc(CCC(O)=O)ccc2n1CCNS(=O)(=O)c1ccc(F)cc1
: