Target
Thromboxane-A synthase
Ligand
BDBM50060386
Substrate
Meas. Tech.
ChEMBL_207780 (CHEMBL880940)
IC50
61±n/a nM
Citation
 Dickinson, RPDack, KNLong, CJSteele, J Thromboxane modulating agents. 3. 1H-imidazol-1-ylalkyl- and 3-pyridinylalkyl-substituted 3-[2-[(arylsulfonyl)amino]ethyl]benzenepropanoic acid derivatives as dual thromboxane synthase inhibitor/thromboxane receptor antagonists. J Med Chem 40:3442-52 (1997)  
Target
Name:
Thromboxane-A synthase
Synonyms:
CYP5 Cytochrome P450 5A1 TBXAS1 TXA synthase TXS Thromboxane A2 Synthase (P450 TxA2) Thromboxane prostanoid Thromboxane-A synthase
Type:
Enzyme
Mol. Mass.:
60524.67
Organism:
Homo sapiens (Human)
Description:
P24557
Residue:
533
  
Inhibitor
Name:
BDBM50060386
Synonyms:
3-[3-[2-(4-Chloro-benzenesulfonylamino)-ethyl]-5-(1-hydroxy-1-pyridin-3-yl-ethyl)-phenyl]-propionic acid | CHEMBL116970
Type:
Small organic molecule
Emp. Form.:
C24H25ClN2O5S
Mol. Mass.:
488.984
SMILES:
CC(O)(c1cccnc1)c1cc(CCNS(=O)(=O)c2ccc(Cl)cc2)cc(CCC(O)=O)c1
: