Target
Thromboxane-A synthase
Ligand
BDBM50060391
Substrate
Meas. Tech.
ChEMBL_207780 (CHEMBL880940)
IC50
22±n/a nM
Citation
 Dickinson, RPDack, KNLong, CJSteele, J Thromboxane modulating agents. 3. 1H-imidazol-1-ylalkyl- and 3-pyridinylalkyl-substituted 3-[2-[(arylsulfonyl)amino]ethyl]benzenepropanoic acid derivatives as dual thromboxane synthase inhibitor/thromboxane receptor antagonists. J Med Chem 40:3442-52 (1997)  
Target
Name:
Thromboxane-A synthase
Synonyms:
CYP5 Cytochrome P450 5A1 TBXAS1 TXA synthase TXS Thromboxane A2 Synthase (P450 TxA2) Thromboxane prostanoid Thromboxane-A synthase
Type:
Enzyme
Mol. Mass.:
60524.67
Organism:
Homo sapiens (Human)
Description:
P24557
Residue:
533
  
Inhibitor
Name:
BDBM50060391
Synonyms:
3-{3-Pyridin-3-ylmethyl-5-[2-(pyrrolidine-1-sulfonylamino)-ethyl]-phenyl}-propionic acid | CHEMBL326356
Type:
Small organic molecule
Emp. Form.:
C21H27N3O4S
Mol. Mass.:
417.522
SMILES:
OC(=O)CCc1cc(CCNS(=O)(=O)N2CCCC2)cc(Cc2cccnc2)c1
: