Target
Histone deacetylase 6
Ligand
BDBM50507688
Substrate
Meas. Tech.
ChEMBL_1831286 (CHEMBL4331294)
Ki
1.6±n/a nM
Citation
 Yu, CWHung, PYYang, HTHo, YHLai, HYCheng, YSChern, JW Quinazolin-2,4-dione-Based Hydroxamic Acids as Selective Histone Deacetylase-6 Inhibitors for Treatment of Non-Small Cell Lung Cancer. J Med Chem 62:857-874 (2019)  
Target
Name:
Histone deacetylase 6
Synonyms:
Cereblon/Histone deacetylase 6 HDAC6 Histone deacetylase 6 (HDAC6) KIAA0901 | ORF Names:JM21
Type:
Chromatin regulator; hydrolase; repressor
Mol. Mass.:
131381.51
Organism:
Homo sapiens (Human)
Description:
Q9UBN7
Residue:
1215
  
Inhibitor
Name:
BDBM50507688
Synonyms:
CHEMBL4550214 | US11535598, Compound 5
Type:
Small organic molecule
Emp. Form.:
C24H21N3O4
Mol. Mass.:
415.4412
SMILES:
ONC(=O)c1ccc(Cn2c3ccccc3c(=O)n(CCc3ccccc3)c2=O)cc1
: