Target
Prostaglandin D2 receptor
Ligand
BDBM50060457
Substrate
Meas. Tech.
ChEMBL_157791 (CHEMBL767849)
IC50
1200±n/a nM
Citation
 Tsuri, THonma, THiramatsu, YOkada, THashizume, HMitsumori, SInagaki, MArimura, AYasui, KAsanuma, FKishino, JOhtani, M Bicyclo[2.2.1]heptane and 6,6-dimethylbicyclo[3.1.1]heptane derivatives: orally active, potent, and selective prostaglandin D2 receptor antagonists. J Med Chem 40:3504-7 (1997)  
Target
Name:
Prostaglandin D2 receptor
Synonyms:
PD2R_HUMAN Prostaglandin D2 Prostanoid DP receptor
Type:
Enzyme
Mol. Mass.:
40288.87
Organism:
Homo sapiens (Human)
Description:
Q13258
Residue:
359
  
Inhibitor
Name:
BDBM50060457
Synonyms:
(Z)-7-[(1S,2R,3R,4R)-3-(Naphthalene-2-sulfonylamino)-bicyclo[2.2.1]hept-2-yl]-hept-5-enoic acid | CHEMBL420507
Type:
Small organic molecule
Emp. Form.:
C24H29NO4S
Mol. Mass.:
427.556
SMILES:
OC(=O)CCC\C=C/C[C@@H]1[C@H]2CC[C@H](C2)[C@H]1NS(=O)(=O)c1ccc2ccccc2c1
: