Target
Neuropeptide FF receptor 1
Ligand
BDBM50037557
Substrate
Meas. Tech.
ChEMBL_1833195 (CHEMBL4333203)
EC50
158±n/a nM
Citation
 Zhang, THan, ZShi, XZhao, WWang, ZZhang, RXu, BZhang, MZhang, QXiao, JZhu, HZheng, TFang, Q Discovery of two novel branched peptidomimetics containing endomorphin-2 and RF9 pharmacophores: Synthesis and neuropharmacological evaluation. Bioorg Med Chem 27:630-643 (2019)  
Target
Name:
Neuropeptide FF receptor 1
Synonyms:
G-protein coupled receptor 147 NPFF1 NPFFR1 | RFamide-related peptide receptor OT7T022
Type:
PROTEIN
Mol. Mass.:
47840.07
Organism:
Homo sapiens (Human)
Description:
ChEMBL_1474637
Residue:
430
  
Inhibitor
Name:
BDBM50037557
Synonyms:
2-{[1-(2-{2-[2-(2-Amino-3-phenyl-propionylamino)-4-methyl-pentanoylamino]-3-phenyl-propionylamino}-4-carbamoyl-butyryl)-pyrrolidine-2-carbonyl]-amino}-pentanedioic acid 5-amide 1-{[1-(1-carbamoyl-2-phenyl-ethylcarbamoyl)-4-guanidino-butyl]-amide} | CHEMBL429731
Type:
Small organic molecule
Emp. Form.:
C54H76N14O10
Mol. Mass.:
1081.269
SMILES:
CC(C)C[C@H](NC(=O)[C@@H](N)Cc1ccccc1)C(=O)N[C@@H](Cc1ccccc1)C(=O)N[C@@H](CCC(N)=O)C(=O)N1CCC[C@H]1C(=O)N[C@@H](CCC(N)=O)C(=O)N[C@@H](CCCNC(N)=N)C(=O)N[C@@H](Cc1ccccc1)C(N)=O
: