Target
Adenosine receptor A2b
Ligand
BDBM50508679
Substrate
Meas. Tech.
ChEMBL_1833780 (CHEMBL4333788)
IC50
>30000±n/a nM
Citation
 Varano, FCatarzi, DFalsini, MDal Ben, DBuccioni, MMarucci, GVolpini, RColotta, V Novel human adenosine receptor antagonists based on the 7-amino-thiazolo[5,4-d]pyrimidine scaffold. Structural investigations at the 2-, 5- and 7-positions to enhance affinity and tune selectivity. Bioorg Med Chem Lett 29:563-569 (2019)  
Target
Name:
Adenosine receptor A2b
Synonyms:
AA2BR_HUMAN ADORA2B Adenosine receptors A2b | Adenosine receptors; A2a & A2b
Type:
G Protein-Coupled Receptor (GPCR)
Mol. Mass.:
36341.22
Organism:
Homo sapiens (Human)
Description:
Residue:
332
  
Inhibitor
Name:
BDBM50508679
Synonyms:
CHEMBL4530682
Type:
Small organic molecule
Emp. Form.:
C16H12N4O2S
Mol. Mass.:
324.357
SMILES:
Nc1nc(nc2sc(nc12)-c1ccco1)-c1cccc(CO)c1
: