Target
Muscarinic acetylcholine receptor M2
Ligand
BDBM50061702
Substrate
Meas. Tech.
ChEMBL_139633 (CHEMBL748246)
IC50
220±n/a nM
Citation
 Bromidge, SMBrown, FCassidy, FClark, MSDabbs, SHadley, MSHawkins, JLoudon, JMNaylor, CBOrlek, BSRiley, GJ Design of [R-(Z)]-(+)-alpha-(methoxyimino)-1-azabicyclo[2.2.2]octane-3-acetonitri le (SB 202026), a functionally selective azabicyclic muscarinic M1 agonist incorporating the N-methoxy imidoyl nitrile group as a novel ester bioisostere. J Med Chem 40:4265-80 (1998)  
Target
Name:
Muscarinic acetylcholine receptor M2
Synonyms:
ACM2_HUMAN Cholinergic, muscarinic M2 Muscarinic acetylcholine receptor M2 and M5 | RecName: Full=Muscarinic acetylcholine receptor M2
Type:
GPCR
Mol. Mass.:
51730.61
Organism:
Homo sapiens (Human)
Description:
P08172
Residue:
466
  
Inhibitor
Name:
BDBM50061702
Synonyms:
(1R,3R,4R)-1-Aza-bicyclo[2.2.1]heptane-3-carbaldehyde O-methyl-oxime | CHEMBL132698
Type:
Small organic molecule
Emp. Form.:
C8H14N2O
Mol. Mass.:
154.2096
SMILES:
CO\N=C\[C@H]1C[N@@]2CC[C@H]1C2
: