Target
Prothrombin
Ligand
BDBM50062019
Substrate
Meas. Tech.
ChEMBL_208344 (CHEMBL813654)
Ki
3600±n/a nM
Citation
 Maduskuie, TPMcNamara, KJRu, YKnabb, RMStouten, PF Rational design and synthesis of novel, potent bis-phenylamidine carboxylate factor Xa inhibitors. J Med Chem 41:53-62 (1998)  
Target
Name:
Prothrombin
Synonyms:
Activation peptide fragment 1 Coagulation factor II Prothrombin precursor Thrombin heavy chain | Thrombin light chain
Type:
Protein
Mol. Mass.:
70029.57
Organism:
Homo sapiens (Human)
Description:
P00734
Residue:
622
  
Inhibitor
Name:
BDBM50062019
Synonyms:
4-[3-(3-Carbamimidoyl-phenyl)-4-methoxycarbonyl-butyl]-benzoic acid methyl ester | CHEMBL156043
Type:
Small organic molecule
Emp. Form.:
C21H24N2O4
Mol. Mass.:
368.4263
SMILES:
COC(=O)CC(CCc1ccc(cc1)C(=O)OC)c1cccc(c1)C(N)=N
: