Target
Coagulation factor X
Ligand
BDBM50062019
Substrate
Meas. Tech.
ChEMBL_48799 (CHEMBL662825)
Ki
2800±n/a nM
Citation
 Maduskuie, TPMcNamara, KJRu, YKnabb, RMStouten, PF Rational design and synthesis of novel, potent bis-phenylamidine carboxylate factor Xa inhibitors. J Med Chem 41:53-62 (1998)  
Target
Name:
Coagulation factor X
Synonyms:
Activated coagulation factor X (FXa) Coagulation factor X precursor F10 Factor X heavy chain Factor Xa Stuart-Prower factor
Type:
Enzyme
Mol. Mass.:
54726.60
Organism:
Homo sapiens (Human)
Description:
Residue:
488
  
Inhibitor
Name:
BDBM50062019
Synonyms:
4-[3-(3-Carbamimidoyl-phenyl)-4-methoxycarbonyl-butyl]-benzoic acid methyl ester | CHEMBL156043
Type:
Small organic molecule
Emp. Form.:
C21H24N2O4
Mol. Mass.:
368.4263
SMILES:
COC(=O)CC(CCc1ccc(cc1)C(=O)OC)c1cccc(c1)C(N)=N
: