Target
Coagulation factor X
Ligand
BDBM50062024
Substrate
Meas. Tech.
ChEMBL_48799 (CHEMBL662825)
Ki
192±n/a nM
Citation
 Maduskuie, TPMcNamara, KJRu, YKnabb, RMStouten, PF Rational design and synthesis of novel, potent bis-phenylamidine carboxylate factor Xa inhibitors. J Med Chem 41:53-62 (1998)  
Target
Name:
Coagulation factor X
Synonyms:
Activated coagulation factor X (FXa) Coagulation factor X precursor F10 Factor X heavy chain Factor Xa Stuart-Prower factor
Type:
Enzyme
Mol. Mass.:
54726.60
Organism:
Homo sapiens (Human)
Description:
Residue:
488
  
Inhibitor
Name:
BDBM50062024
Synonyms:
5-(4-Carbamimidoyl-phenyl)-3-(3-carbamimidoyl-phenyl)-pentanoic acid isopropyl ester | CHEMBL439642
Type:
Small organic molecule
Emp. Form.:
C22H28N4O2
Mol. Mass.:
380.4833
SMILES:
CC(C)OC(=O)CC(CCc1ccc(cc1)C(N)=N)c1cccc(c1)C(N)=N
: