Target
Coagulation factor X
Ligand
BDBM50062028
Substrate
Meas. Tech.
ChEMBL_48799 (CHEMBL662825)
Ki
1642±n/a nM
Citation
 Maduskuie, TPMcNamara, KJRu, YKnabb, RMStouten, PF Rational design and synthesis of novel, potent bis-phenylamidine carboxylate factor Xa inhibitors. J Med Chem 41:53-62 (1998)  
Target
Name:
Coagulation factor X
Synonyms:
Activated coagulation factor X (FXa) Coagulation factor X precursor F10 Factor X heavy chain Factor Xa Stuart-Prower factor
Type:
Enzyme
Mol. Mass.:
54726.60
Organism:
Homo sapiens (Human)
Description:
Residue:
488
  
Inhibitor
Name:
BDBM50062028
Synonyms:
5-(3-Carbamimidoyl-phenyl)-3-(4-carbamimidoyl-phenyl)-pentanoic acid ethyl ester | CHEMBL158207
Type:
Small organic molecule
Emp. Form.:
C21H26N4O2
Mol. Mass.:
366.4567
SMILES:
CCOC(=O)CC(CCc1cccc(c1)C(N)=N)c1ccc(cc1)C(N)=N
: