Target
Coagulation factor X
Ligand
BDBM50062030
Substrate
Meas. Tech.
ChEMBL_48799 (CHEMBL662825)
Ki
5100±n/a nM
Citation
 Maduskuie, TPMcNamara, KJRu, YKnabb, RMStouten, PF Rational design and synthesis of novel, potent bis-phenylamidine carboxylate factor Xa inhibitors. J Med Chem 41:53-62 (1998)  
Target
Name:
Coagulation factor X
Synonyms:
Activated coagulation factor X (FXa) Coagulation factor X precursor F10 Factor X heavy chain Factor Xa Stuart-Prower factor
Type:
Enzyme
Mol. Mass.:
54726.60
Organism:
Homo sapiens (Human)
Description:
Residue:
488
  
Inhibitor
Name:
BDBM50062030
Synonyms:
1-[3-amino(imino)methylphenyl]-3-[4-amino(imino)methylphenyl]-1-propanone | CHEMBL157601
Type:
Small organic molecule
Emp. Form.:
C17H18N4O
Mol. Mass.:
294.351
SMILES:
NC(=N)c1ccc(CCC(=O)c2cccc(c2)C(N)=N)cc1
: