Target
Prothrombin
Ligand
BDBM50062027
Substrate
Meas. Tech.
ChEMBL_208344 (CHEMBL813654)
Ki
3100±n/a nM
Citation
 Maduskuie, TPMcNamara, KJRu, YKnabb, RMStouten, PF Rational design and synthesis of novel, potent bis-phenylamidine carboxylate factor Xa inhibitors. J Med Chem 41:53-62 (1998)  
Target
Name:
Prothrombin
Synonyms:
Activation peptide fragment 1 Coagulation factor II Prothrombin precursor Thrombin heavy chain | Thrombin light chain
Type:
Protein
Mol. Mass.:
70029.57
Organism:
Homo sapiens (Human)
Description:
P00734
Residue:
622
  
Inhibitor
Name:
BDBM50062027
Synonyms:
3-(3-Carbamimidoyl-phenyl)-5-(4-guanidino-phenyl)-pentanoic acid methyl ester | CHEMBL156161
Type:
Small organic molecule
Emp. Form.:
C20H25N5O2
Mol. Mass.:
367.4448
SMILES:
[#6]-[#8]-[#6](=O)-[#6]-[#6](-[#6]-[#6]-c1ccc(cc1)\[#7]=[#6](/[#7])-[#7])-c1cccc(c1)-[#6](-[#7])=[#7]
: