Target
Prothrombin
Ligand
BDBM50062023
Substrate
Meas. Tech.
ChEMBL_208344 (CHEMBL813654)
Ki
1750±n/a nM
Citation
 Maduskuie, TPMcNamara, KJRu, YKnabb, RMStouten, PF Rational design and synthesis of novel, potent bis-phenylamidine carboxylate factor Xa inhibitors. J Med Chem 41:53-62 (1998)  
Target
Name:
Prothrombin
Synonyms:
Activation peptide fragment 1 Coagulation factor II Prothrombin precursor Thrombin heavy chain | Thrombin light chain
Type:
Protein
Mol. Mass.:
70029.57
Organism:
Homo sapiens (Human)
Description:
P00734
Residue:
622
  
Inhibitor
Name:
BDBM50062023
Synonyms:
5-(4-Benzenesulfonylamino-phenyl)-3-(3-carbamimidoyl-phenyl)-pentanoic acid methyl ester | CHEMBL348038
Type:
Small organic molecule
Emp. Form.:
C25H27N3O4S
Mol. Mass.:
465.565
SMILES:
COC(=O)CC(CCc1ccc(NS(=O)(=O)c2ccccc2)cc1)c1cccc(c1)C(N)=N
: