Target
Prothrombin
Ligand
BDBM50062034
Substrate
Meas. Tech.
ChEMBL_208344 (CHEMBL813654)
Ki
6500±n/a nM
Citation
 Maduskuie, TPMcNamara, KJRu, YKnabb, RMStouten, PF Rational design and synthesis of novel, potent bis-phenylamidine carboxylate factor Xa inhibitors. J Med Chem 41:53-62 (1998)  
Target
Name:
Prothrombin
Synonyms:
Activation peptide fragment 1 Coagulation factor II Prothrombin precursor Thrombin heavy chain | Thrombin light chain
Type:
Protein
Mol. Mass.:
70029.57
Organism:
Homo sapiens (Human)
Description:
P00734
Residue:
622
  
Inhibitor
Name:
BDBM50062034
Synonyms:
3-(3-Carbamimidoyl-phenyl)-5-(4-carbamoyl-phenyl)-pentanoic acid methyl ester | CHEMBL155871
Type:
Small organic molecule
Emp. Form.:
C20H23N3O3
Mol. Mass.:
353.4149
SMILES:
COC(=O)CC(CCc1ccc(cc1)C(N)=O)c1cccc(c1)C(N)=N
: