Target
Coagulation factor X
Ligand
BDBM50062021
Substrate
Meas. Tech.
ChEMBL_48799 (CHEMBL662825)
Ki
2900±n/a nM
Citation
 Maduskuie, TPMcNamara, KJRu, YKnabb, RMStouten, PF Rational design and synthesis of novel, potent bis-phenylamidine carboxylate factor Xa inhibitors. J Med Chem 41:53-62 (1998)  
Target
Name:
Coagulation factor X
Synonyms:
Activated coagulation factor X (FXa) Coagulation factor X precursor F10 Factor X heavy chain Factor Xa Stuart-Prower factor
Type:
Enzyme
Mol. Mass.:
54726.60
Organism:
Homo sapiens (Human)
Description:
Residue:
488
  
Inhibitor
Name:
BDBM50062021
Synonyms:
3-(3-Carbamimidoyl-phenyl)-5-phenyl-pentanoic acid ethyl ester | CHEMBL435638
Type:
Small organic molecule
Emp. Form.:
C20H24N2O2
Mol. Mass.:
324.4168
SMILES:
CCOC(=O)CC(CCc1ccccc1)c1cccc(c1)C(N)=N
: