Target
Coagulation factor X
Ligand
BDBM50062037
Substrate
Meas. Tech.
ChEMBL_48799 (CHEMBL662825)
Ki
1150±n/a nM
Citation
 Maduskuie, TPMcNamara, KJRu, YKnabb, RMStouten, PF Rational design and synthesis of novel, potent bis-phenylamidine carboxylate factor Xa inhibitors. J Med Chem 41:53-62 (1998)  
Target
Name:
Coagulation factor X
Synonyms:
Activated coagulation factor X (FXa) Coagulation factor X precursor F10 Factor X heavy chain Factor Xa Stuart-Prower factor
Type:
Enzyme
Mol. Mass.:
54726.60
Organism:
Homo sapiens (Human)
Description:
Residue:
488
  
Inhibitor
Name:
BDBM50062037
Synonyms:
3-[3-amino(imino)methylphenyl]-5-[4-amino(imino)methylphenyl]-1-(1H-1-pyrrolyl)-1-pentanone | CHEMBL158063
Type:
Small organic molecule
Emp. Form.:
C23H25N5O
Mol. Mass.:
387.4775
SMILES:
NC(=N)c1ccc(CCC(CC(=O)n2cccc2)c2cccc(c2)C(N)=N)cc1
: