Target
Serine protease 1
Ligand
BDBM50062033
Substrate
Meas. Tech.
ChEMBL_210650 (CHEMBL811612)
Ki
110±n/a nM
Citation
 Maduskuie, TPMcNamara, KJRu, YKnabb, RMStouten, PF Rational design and synthesis of novel, potent bis-phenylamidine carboxylate factor Xa inhibitors. J Med Chem 41:53-62 (1998)  
Target
Name:
Serine protease 1
Synonyms:
Alpha-trypsin chain 1 Beta-trypsin PRSS1 TRP1 TRY1_HUMAN Thrombin & trypsin Trypsin I | Trypsin-1
Type:
Enzyme
Mol. Mass.:
26557.80
Organism:
Homo sapiens (Human)
Description:
P07477
Residue:
247
  
Inhibitor
Name:
BDBM50062033
Synonyms:
5-(4-Carbamimidoyl-phenyl)-3-(3-carbamimidoyl-phenyl)-pentanoic acid ethyl ester | CHEMBL155820
Type:
Small organic molecule
Emp. Form.:
C21H26N4O2
Mol. Mass.:
366.4567
SMILES:
CCOC(=O)CC(CCc1ccc(cc1)C(N)=N)c1cccc(c1)C(N)=N
: