Target
Serine protease 1
Ligand
BDBM50062037
Substrate
Meas. Tech.
ChEMBL_210650 (CHEMBL811612)
Ki
440±n/a nM
Citation
 Maduskuie, TPMcNamara, KJRu, YKnabb, RMStouten, PF Rational design and synthesis of novel, potent bis-phenylamidine carboxylate factor Xa inhibitors. J Med Chem 41:53-62 (1998)  
Target
Name:
Serine protease 1
Synonyms:
Alpha-trypsin chain 1 Beta-trypsin PRSS1 TRP1 TRY1_HUMAN Thrombin & trypsin Trypsin I | Trypsin-1
Type:
Enzyme
Mol. Mass.:
26557.80
Organism:
Homo sapiens (Human)
Description:
P07477
Residue:
247
  
Inhibitor
Name:
BDBM50062037
Synonyms:
3-[3-amino(imino)methylphenyl]-5-[4-amino(imino)methylphenyl]-1-(1H-1-pyrrolyl)-1-pentanone | CHEMBL158063
Type:
Small organic molecule
Emp. Form.:
C23H25N5O
Mol. Mass.:
387.4775
SMILES:
NC(=N)c1ccc(CCC(CC(=O)n2cccc2)c2cccc(c2)C(N)=N)cc1
: