Target
Serine protease 1
Ligand
BDBM50062038
Substrate
Meas. Tech.
ChEMBL_210650 (CHEMBL811612)
Ki
760±n/a nM
Citation
 Maduskuie, TPMcNamara, KJRu, YKnabb, RMStouten, PF Rational design and synthesis of novel, potent bis-phenylamidine carboxylate factor Xa inhibitors. J Med Chem 41:53-62 (1998)  
Target
Name:
Serine protease 1
Synonyms:
Alpha-trypsin chain 1 Beta-trypsin PRSS1 TRP1 TRY1_HUMAN Thrombin & trypsin Trypsin I | Trypsin-1
Type:
Enzyme
Mol. Mass.:
26557.80
Organism:
Homo sapiens (Human)
Description:
P07477
Residue:
247
  
Inhibitor
Name:
BDBM50062038
Synonyms:
3-(3-Carbamimidoyl-phenyl)-7-(4-guanidino-phenyl)-heptanoic acid methyl ester | CHEMBL351329
Type:
Small organic molecule
Emp. Form.:
C22H29N5O2
Mol. Mass.:
395.498
SMILES:
[#6]-[#8]-[#6](=O)-[#6]-[#6](-[#6]-[#6]-[#6]-[#6]-c1ccc(cc1)\[#7]=[#6](/[#7])-[#7])-c1cccc(c1)-[#6](-[#7])=[#7]
: