Target
Coagulation factor X
Ligand
BDBM50062034
Substrate
Meas. Tech.
ChEMBL_48799 (CHEMBL662825)
Ki
550±n/a nM
Citation
 Maduskuie, TPMcNamara, KJRu, YKnabb, RMStouten, PF Rational design and synthesis of novel, potent bis-phenylamidine carboxylate factor Xa inhibitors. J Med Chem 41:53-62 (1998)  
Target
Name:
Coagulation factor X
Synonyms:
Activated coagulation factor X (FXa) Coagulation factor X precursor F10 Factor X heavy chain Factor Xa Stuart-Prower factor
Type:
Enzyme
Mol. Mass.:
54726.60
Organism:
Homo sapiens (Human)
Description:
Residue:
488
  
Inhibitor
Name:
BDBM50062034
Synonyms:
3-(3-Carbamimidoyl-phenyl)-5-(4-carbamoyl-phenyl)-pentanoic acid methyl ester | CHEMBL155871
Type:
Small organic molecule
Emp. Form.:
C20H23N3O3
Mol. Mass.:
353.4149
SMILES:
COC(=O)CC(CCc1ccc(cc1)C(N)=O)c1cccc(c1)C(N)=N
: