Target
Coagulation factor X
Ligand
BDBM50062023
Substrate
Meas. Tech.
ChEMBL_48799 (CHEMBL662825)
Ki
1100±n/a nM
Citation
 Maduskuie, TPMcNamara, KJRu, YKnabb, RMStouten, PF Rational design and synthesis of novel, potent bis-phenylamidine carboxylate factor Xa inhibitors. J Med Chem 41:53-62 (1998)  
Target
Name:
Coagulation factor X
Synonyms:
Activated coagulation factor X (FXa) Coagulation factor X precursor F10 Factor X heavy chain Factor Xa Stuart-Prower factor
Type:
Enzyme
Mol. Mass.:
54726.60
Organism:
Homo sapiens (Human)
Description:
Residue:
488
  
Inhibitor
Name:
BDBM50062023
Synonyms:
5-(4-Benzenesulfonylamino-phenyl)-3-(3-carbamimidoyl-phenyl)-pentanoic acid methyl ester | CHEMBL348038
Type:
Small organic molecule
Emp. Form.:
C25H27N3O4S
Mol. Mass.:
465.565
SMILES:
COC(=O)CC(CCc1ccc(NS(=O)(=O)c2ccccc2)cc1)c1cccc(c1)C(N)=N
: