Target
Prothrombin
Ligand
BDBM50062037
Substrate
Meas. Tech.
ChEMBL_208344 (CHEMBL813654)
Ki
2800±n/a nM
Citation
 Maduskuie, TPMcNamara, KJRu, YKnabb, RMStouten, PF Rational design and synthesis of novel, potent bis-phenylamidine carboxylate factor Xa inhibitors. J Med Chem 41:53-62 (1998)  
Target
Name:
Prothrombin
Synonyms:
Activation peptide fragment 1 Coagulation factor II Prothrombin precursor Thrombin heavy chain | Thrombin light chain
Type:
Protein
Mol. Mass.:
70029.57
Organism:
Homo sapiens (Human)
Description:
P00734
Residue:
622
  
Inhibitor
Name:
BDBM50062037
Synonyms:
3-[3-amino(imino)methylphenyl]-5-[4-amino(imino)methylphenyl]-1-(1H-1-pyrrolyl)-1-pentanone | CHEMBL158063
Type:
Small organic molecule
Emp. Form.:
C23H25N5O
Mol. Mass.:
387.4775
SMILES:
NC(=N)c1ccc(CCC(CC(=O)n2cccc2)c2cccc(c2)C(N)=N)cc1
: