Target
Serine protease 1
Ligand
BDBM50062034
Substrate
Meas. Tech.
ChEMBL_210650 (CHEMBL811612)
Ki
870±n/a nM
Citation
 Maduskuie, TPMcNamara, KJRu, YKnabb, RMStouten, PF Rational design and synthesis of novel, potent bis-phenylamidine carboxylate factor Xa inhibitors. J Med Chem 41:53-62 (1998)  
Target
Name:
Serine protease 1
Synonyms:
Alpha-trypsin chain 1 Beta-trypsin PRSS1 TRP1 TRY1_HUMAN Thrombin & trypsin Trypsin I | Trypsin-1
Type:
Enzyme
Mol. Mass.:
26557.80
Organism:
Homo sapiens (Human)
Description:
P07477
Residue:
247
  
Inhibitor
Name:
BDBM50062034
Synonyms:
3-(3-Carbamimidoyl-phenyl)-5-(4-carbamoyl-phenyl)-pentanoic acid methyl ester | CHEMBL155871
Type:
Small organic molecule
Emp. Form.:
C20H23N3O3
Mol. Mass.:
353.4149
SMILES:
COC(=O)CC(CCc1ccc(cc1)C(N)=O)c1cccc(c1)C(N)=N
: