Target
Prothrombin
Ligand
BDBM50062028
Substrate
Meas. Tech.
ChEMBL_208344 (CHEMBL813654)
Ki
3433±n/a nM
Citation
 Maduskuie, TPMcNamara, KJRu, YKnabb, RMStouten, PF Rational design and synthesis of novel, potent bis-phenylamidine carboxylate factor Xa inhibitors. J Med Chem 41:53-62 (1998)  
Target
Name:
Prothrombin
Synonyms:
Activation peptide fragment 1 Coagulation factor II Prothrombin precursor Thrombin heavy chain | Thrombin light chain
Type:
Protein
Mol. Mass.:
70029.57
Organism:
Homo sapiens (Human)
Description:
P00734
Residue:
622
  
Inhibitor
Name:
BDBM50062028
Synonyms:
5-(3-Carbamimidoyl-phenyl)-3-(4-carbamimidoyl-phenyl)-pentanoic acid ethyl ester | CHEMBL158207
Type:
Small organic molecule
Emp. Form.:
C21H26N4O2
Mol. Mass.:
366.4567
SMILES:
CCOC(=O)CC(CCc1cccc(c1)C(N)=N)c1ccc(cc1)C(N)=N
: