Target
Prolyl endopeptidase
Ligand
BDBM50038879
Substrate
Meas. Tech.
ChEMBL_1836620 (CHEMBL4336753)
Ki
0.400000±n/a nM
Citation
 Plescia, JDe Cesco, SPatrascu, MBKurian, JDi Trani, JDufresne, CWahba, ASJanmamode, NMittermaier, AKMoitessier, N Integrated Synthetic, Biophysical, and Computational Investigations of Covalent Inhibitors of Prolyl Oligopeptidase and Fibroblast Activation Protein ?. J Med Chem 62:7874-7884 (2019)  
Target
Name:
Prolyl endopeptidase
Synonyms:
PE POP PREP Prolyl oligopeptidase
Type:
Enzyme
Mol. Mass.:
80688.50
Organism:
Homo sapiens (Human)
Description:
P48147
Residue:
710
  
Inhibitor
Name:
BDBM50038879
Synonyms:
(S)-2-(2-Formyl-pyrrolidine-1-carbonyl)-pyrrolidine-1-carboxylic acid benzyl ester JTP-4819 | Z-PRO-PROLINAL
Type:
Small organic molecule
Emp. Form.:
C18H22N2O4
Mol. Mass.:
330.3783
SMILES:
O=C[C@@H]1CCCN1C(=O)[C@@H]1CCCN1C(=O)OCc1ccccc1
: