Target
Arginase-1
Ligand
BDBM50509002
Substrate
Meas. Tech.
ChEMBL_1837116 (CHEMBL4337249)
IC50
340±n/a nM
Citation
 Van Zandt, MCJagdmann, GEWhitehouse, DLJi, MSavoy, JPotapova, OCousido-Siah, AMitschler, AHoward, EIPyle, AMPodjarny, AD Discovery of  J Med Chem 62:8164-8177 (2019)  
Target
Name:
Arginase-1
Synonyms:
ARG1 Liver-type arginase | Type I arginase
Type:
PROTEIN
Mol. Mass.:
34737.53
Organism:
Homo sapiens (Human)
Description:
ChEMBL_978893
Residue:
322
  
Inhibitor
Name:
BDBM50509002
Synonyms:
CHEMBL4590074
Type:
Small organic molecule
Emp. Form.:
C15H27BN4O4
Mol. Mass.:
338.21
SMILES:
Cc1nn(C)c(C)c1CN1C[C@H](CCCB(O)O)[C@@](N)(C1)C(O)=O
: