Target
Arginase-1
Ligand
BDBM50509005
Substrate
Meas. Tech.
ChEMBL_1837116 (CHEMBL4337249)
IC50
600±n/a nM
Citation
 Van Zandt, MCJagdmann, GEWhitehouse, DLJi, MSavoy, JPotapova, OCousido-Siah, AMitschler, AHoward, EIPyle, AMPodjarny, AD Discovery of  J Med Chem 62:8164-8177 (2019)  
Target
Name:
Arginase-1
Synonyms:
ARG1 Liver-type arginase | Type I arginase
Type:
PROTEIN
Mol. Mass.:
34737.53
Organism:
Homo sapiens (Human)
Description:
ChEMBL_978893
Residue:
322
  
Inhibitor
Name:
BDBM50509005
Synonyms:
CHEMBL4444238
Type:
Small organic molecule
Emp. Form.:
C14H22BN3O4
Mol. Mass.:
307.153
SMILES:
N[C@]1(CN(Cc2ccncc2)C[C@@H]1CCCB(O)O)C(O)=O
: