Target
Arginase-1
Ligand
BDBM50509004
Substrate
Meas. Tech.
ChEMBL_1837116 (CHEMBL4337249)
IC50
380±n/a nM
Citation
 Van Zandt, MCJagdmann, GEWhitehouse, DLJi, MSavoy, JPotapova, OCousido-Siah, AMitschler, AHoward, EIPyle, AMPodjarny, AD Discovery of  J Med Chem 62:8164-8177 (2019)  
Target
Name:
Arginase-1
Synonyms:
ARG1 Liver-type arginase | Type I arginase
Type:
PROTEIN
Mol. Mass.:
34737.53
Organism:
Homo sapiens (Human)
Description:
ChEMBL_978893
Residue:
322
  
Inhibitor
Name:
BDBM50509004
Synonyms:
CHEMBL4546530
Type:
Small organic molecule
Emp. Form.:
C9H18BNO4
Mol. Mass.:
215.055
SMILES:
NC1(CCCC1CCCB(O)O)C(O)=O
: