Target
Arginase-1
Ligand
BDBM290377
Substrate
Meas. Tech.
ChEMBL_1837116 (CHEMBL4337249)
IC50
470±n/a nM
Citation
 Van Zandt, MCJagdmann, GEWhitehouse, DLJi, MSavoy, JPotapova, OCousido-Siah, AMitschler, AHoward, EIPyle, AMPodjarny, AD Discovery of  J Med Chem 62:8164-8177 (2019)  
Target
Name:
Arginase-1
Synonyms:
ARG1 Liver-type arginase | Type I arginase
Type:
PROTEIN
Mol. Mass.:
34737.53
Organism:
Homo sapiens (Human)
Description:
ChEMBL_978893
Residue:
322
  
Inhibitor
Name:
BDBM290377
Synonyms:
(3R,4S)-3-amino-4-(3-boronopropyl)-1-(pyridin-3- ylmethyl)pyrrolidine-3-carboxylic acid US10603330, Example 13 | US11389464, Example 13
Type:
Small organic molecule
Emp. Form.:
C14H22BN3O4
Mol. Mass.:
307.153
SMILES:
N[C@]1(CN(Cc2cccnc2)C[C@@H]1CCCB(O)O)C(O)=O
: