Target
Serine protease 1/Trypsin-2
Ligand
BDBM50062693
Substrate
Meas. Tech.
ChEMBL_212349 (CHEMBL816796)
IC50
1400±n/a nM
Citation
 Klein, SICzekaj, MGardner, CJGuertin, KRCheney, DLSpada, APBolton, SABrown, KColussi, DHeran, CLMorgan, SRLeadley, RJDunwiddie, CTPerrone, MHChu, V Identification and initial structure-activity relationships of a novel class of nonpeptide inhibitors of blood coagulation factor Xa. J Med Chem 41:437-50 (1998)  
Target
Name:
Serine protease 1/Trypsin-2
Synonyms:
Trypsin II
Type:
Mol. Mass.:
Description:
ASSAY_ID of EBI is 212335
Components:
This complex has 2 components.
Component 1
Name:
Serine protease 1
Synonyms:
Alpha-trypsin chain 1 Beta-trypsin PRSS1 TRP1 TRY1_HUMAN Thrombin & trypsin Trypsin I | Trypsin-1
Type:
Enzyme
Mol. Mass.:
26557.80
Organism:
Homo sapiens (Human)
Description:
P07477
Residue:
247
  
Component 2
Name:
Trypsin-2
Synonyms:
Anionic trypsinogen Serine protease 2 TRY2_HUMAN Thrombin & trypsin Trypsin II | Trypsin-2
Type:
PROTEIN
Mol. Mass.:
26479.43
Organism:
Homo sapiens (Human)
Description:
ChEMBL_41517
Residue:
247
  
Inhibitor
Name:
BDBM50062693
Synonyms:
Acetic acid (E)-3-[(biphenyl-4-carbonyl)-amino]-2-(3-carbamimidoyl-benzyl)-5-phenyl-pent-4-enyl ester | CHEMBL138217
Type:
Small organic molecule
Emp. Form.:
C34H33N3O3
Mol. Mass.:
531.6441
SMILES:
CC(=O)OCC(Cc1cccc(c1)C(N)=N)C(NC(=O)c1ccc(cc1)-c1ccccc1)\C=C\c1ccccc1
: