Target
Coagulation factor X
Ligand
BDBM50062705
Substrate
Meas. Tech.
ChEMBL_48636 (CHEMBL874700)
IC50
1100±n/a nM
Citation
 Klein, SICzekaj, MGardner, CJGuertin, KRCheney, DLSpada, APBolton, SABrown, KColussi, DHeran, CLMorgan, SRLeadley, RJDunwiddie, CTPerrone, MHChu, V Identification and initial structure-activity relationships of a novel class of nonpeptide inhibitors of blood coagulation factor Xa. J Med Chem 41:437-50 (1998)  
Target
Name:
Coagulation factor X
Synonyms:
Activated coagulation factor X (FXa) Coagulation factor X precursor F10 Factor X heavy chain Factor Xa Stuart-Prower factor
Type:
Enzyme
Mol. Mass.:
54726.60
Organism:
Homo sapiens (Human)
Description:
Residue:
488
  
Inhibitor
Name:
BDBM50062705
Synonyms:
(E)-2-(3-Carbamimidoyl-benzyl)-3-(3-methyl-benzoylamino)-5-phenyl-pent-4-enoic acid methyl ester | CHEMBL343772
Type:
Small organic molecule
Emp. Form.:
C28H29N3O3
Mol. Mass.:
455.5482
SMILES:
COC(=O)C(Cc1cccc(c1)C(N)=N)C(NC(=O)c1cccc(C)c1)\C=C\c1ccccc1
: