Target
Coagulation factor X
Ligand
BDBM50062684
Substrate
Meas. Tech.
ChEMBL_48636 (CHEMBL874700)
IC50
240±n/a nM
Citation
 Klein, SICzekaj, MGardner, CJGuertin, KRCheney, DLSpada, APBolton, SABrown, KColussi, DHeran, CLMorgan, SRLeadley, RJDunwiddie, CTPerrone, MHChu, V Identification and initial structure-activity relationships of a novel class of nonpeptide inhibitors of blood coagulation factor Xa. J Med Chem 41:437-50 (1998)  
Target
Name:
Coagulation factor X
Synonyms:
Activated coagulation factor X (FXa) Coagulation factor X precursor F10 Factor X heavy chain Factor Xa Stuart-Prower factor
Type:
Enzyme
Mol. Mass.:
54726.60
Organism:
Homo sapiens (Human)
Description:
Residue:
488
  
Inhibitor
Name:
BDBM50062684
Synonyms:
(E)-2-(3-Carbamimidoyl-benzyl)-3-[(4'-methyl-biphenyl-4-carbonyl)-amino]-5-phenyl-pent-4-enoic acid methyl ester | CHEMBL344831
Type:
Small organic molecule
Emp. Form.:
C34H33N3O3
Mol. Mass.:
531.6441
SMILES:
COC(=O)C(Cc1cccc(c1)C(N)=N)C(NC(=O)c1ccc(cc1)-c1ccc(C)cc1)\C=C\c1ccccc1
: