Target
D(1A) dopamine receptor
Ligand
BDBM50509507
Substrate
Meas. Tech.
ChEMBL_1838592 (CHEMBL4338725)
EC50
18±n/a nM
Citation
 Rosse, G Novel Pyrazolyl-dihydroisoquinolines as Positive Allosteric Modulator of the Dopamine D1 Receptor. ACS Med Chem Lett 11:0 (2020)  
Target
Name:
D(1A) dopamine receptor
Synonyms:
DA D1 receptor DRD1 Dopamine D1 receptor Dopamine D1A
Type:
Enzyme
Mol. Mass.:
49303.43
Organism:
Homo sapiens (Human)
Description:
P21728
Residue:
446
  
Inhibitor
Name:
BDBM50509507
Synonyms:
CHEMBL4536851
Type:
Small organic molecule
Emp. Form.:
C24H25Cl2N3O3
Mol. Mass.:
474.38
SMILES:
C[C@@H]1N([C@@H](CO)Cc2c1cccc2-c1cnn(CCO)c1)C(=O)Cc1c(Cl)cccc1Cl
: